{"text_format":"1","workbook":"xlsx","n_sheets":16,"sheets":["Title Page","User Input","POD Types","Type I Needs","Type I Costs","Type II Needs","Type II Costs","Type III Needs","Type III Costs","Initial Costs","Annual Costs","Gap Costs","HoldShapes","Lists","FormatHold","CostsQuants"],"not_rendered":{"charts":21,"images":5,"macros":1,"external_links":0,"defined_names":100,"comments":0,"pivot_tables":0},"unopened":[],"bounds":{"document_bytes":16777216,"sheet_cells":100000,"rows_first":2000,"rows_last":500,"rows_between":2000,"halvings":0,"cell_chars":16384,"cell_head_chars":4096},"cells_cut":0,"cells_raw":0,"read":"whole","date_system":"1900"}

{"sheet":"Title Page","index":0,"n_rows":13,"n_cols":2,"rows_kept":13,"cut":false,"hidden":false,"merged":[[6,1,11,12],[12,1,14,12]]}
[]
[]
[]
[]
[]
[]
[null,"Non-Medical Points of Distribution (PODs) Capability Cost Calculator"]
[]
[]
[]
[]
[]
[null,"A tool for jurisdictional planners to estimate the number of PODs needed by their jurisdiction and to estimate the associated costs."]

{"sheet":"User Input","index":1,"n_rows":52,"n_cols":24,"rows_kept":52,"cut":false,"hidden":false,"merged":[[24,2,24,7],[24,8,24,9],[26,23,30,23],[31,6,31,8],[28,2,29,13],[26,2,26,7],[26,8,26,9],[34,9,34,10],[34,3,34,4],[44,3,44,4],[44,7,44,11],[49,3,49,11],[45,8,45,10],[21,19,21,22],[21,1,22,8],[21,9,22,13],[9,9,10,13],[9,1,10,8],[16,2,16,6],[14,2,14,6],[13,2,13,6],[12,2,12,6],[16,7,16,8],[14,7,14,8],[13,7,13,8],[12,7,12,8]]}
[]
[]
[]
[]
[]
[]
[]
[]
[]
[null,"Jurisdictional Input"]
[]
[]
[null,null,"Jurisdiction Population: ",null,null,null,null,250000]
[null,null,"Additional Population to Include: ",null,null,null,null,50000]
[null,null,"Percent of Population in Need of POD Services: ",null,null,null,null,0.75]
[]
[null,null,"Total Population to Serve with PODs: ",null,null,null,null,{"$f":"H15*(H14+H13)","v":225000}]
[]
[]
[]
{"$rows_left_out":33}
{"sheet":"POD Types","index":2,"n_rows":120,"n_cols":16,"rows_kept":120,"cut":false,"hidden":false,"merged":[[10,9,11,17],[96,14,96,16],[119,14,119,16],[43,1,44,8],[10,1,11,8],[15,1,15,3],[29,1,29,2],[43,9,44,17],[68,10,68,11],[86,11,86,14],[73,6,73,9],[72,6,72,9],[71,6,71,9],[70,6,70,9],[68,6,68,9],[68,12,68,14],[90,15,90,16],[73,10,73,11],[72,10,72,11],[71,10,71,11],[70,10,70,11],[46,8,46,10],[77,8,77,10],[110,11,110,14],[110,15,110,16],[91,11,91,14],[91,15,91,16],[69,6,69,9],[69,10,69,11],[87,11,87,14],[87,15,87,16],[86,15,86,16],[88,11,88,14],[88,15,88,16],[89,11,89,14],[89,15,89,16],[90,11,90,14],[115,11,115,14],[115,15,115,16],[104,8,104,10],[112,11,112,14],[112,15,112,16],[113,11,113,14],[113,15,113,16],[114,11,114,14],[114,15,114,16],[111,11,111,14],[111,15,111,16]]}
[]
[]
[]
[]
[]
[]
[]
[]
[]
[]
[null,"POD Module: Loading Points"]
[]
[]
[]
[]
[null,"Loading Point"]
[]
[]
[]
[]
{"$rows_left_out":101}
{"sheet":"Type I Needs","index":3,"n_rows":79,"n_cols":15,"rows_kept":79,"cut":false,"hidden":false,"merged":[[77,1,77,7],[14,14,15,17],[66,1,66,7],[67,1,67,7],[68,1,68,7],[75,1,75,7],[76,1,76,7],[41,1,41,8],[42,1,42,8],[64,1,64,7],[65,1,65,7],[21,1,21,8],[22,1,22,8],[23,1,23,8],[24,1,24,8],[30,1,30,8],[16,1,16,8],[17,1,17,8],[18,1,18,8],[19,1,19,8],[20,1,20,8],[8,2,8,5],[9,7,9,13],[14,1,15,8],[14,9,15,12],[12,12,13,12],[12,11,13,11],[12,10,13,10],[12,9,13,9],[8,7,8,10],[72,1,73,8],[72,9,73,12],[31,1,31,8],[32,1,32,8],[33,1,33,8],[34,1,34,8],[35,1,35,8],[36,1,36,8],[37,1,37,8],[38,1,38,8],[39,1,39,8],[40,1,40,8],[48,1,48,8],[49,1,49,8],[46,1,47,10],[46,14,46,17],[47,14,57,17],[28,1,29,8],[28,9,29,12],[61,1,62,8],[61,9,62,12],[56,1,56,7],[55,1,55,7],[54,1,54,7],[53,1,53,7],[52,1,52,7],[51,1,51,7],[50,1,50,7],[50,8,51,8],[57,1,57,7],[46,11,47,12]]}
[]
[]
[]
[]
[]
[]
[]
[]
[null,null,"Your capability need is",null,null,null,{"$f":"IF(InputPerNum=\"Percent\",'User Input'!L36,'User Input'!F46)","v":4},"Type I PODs, operating for",null,null,null,{"$f":"CONCATENATE(SUM('User Input'!I25:J25), \" days\")","v":"3 days"}]
[null,null,null,null,null,null,null,"You can adjust costs and quantities below to reflect your actual costs and needs."]
[]
[]
[null,null,null,null,null,null,null,null,null,"Default Quantities","Quantities","Unit Costs","Initial Cost"]
[]
[null,"Loading Point Equipment",null,null,null,null,null,null,null,{"$f":"M26","v":465454},null,null,null,null,"For more information about a Type I POD…"]
[]
[null,"Forklifts",null,null,null,null,null,null,null,{"$f":"$G$9*CostsQuants!J17","v":12},{"$f":"J17","v":12},25000,{"$f":"K17*L17","v":300000}]
[null,"Pallet Jacks",null,null,null,null,null,null,null,{"$f":"$G$9*CostsQuants!J18","v":12},12,365,{"$f":"K18*L18","v":4380}]
[null,"Power Light Set",null,null,null,null,null,null,null,{"$f":"$G$9*CostsQuants!J19","v":8},8,11230,89840]
[null,"Toilets",null,null,null,null,null,null,null,{"$f":"$G$9*CostsQuants!J20","v":24},24,686,16464]
{"$rows_left_out":60}
{"sheet":"Type I Costs","index":4,"n_rows":119,"n_cols":25,"rows_kept":119,"cut":false,"hidden":false,"merged":[[99,0,100,0],[107,1,107,5],[108,1,108,5],[109,1,109,5],[110,1,110,5],[102,1,102,5],[103,1,103,5],[104,1,104,5],[105,1,105,5],[106,1,106,5],[92,1,92,5],[93,1,93,5],[94,1,94,5],[70,11,71,14],[59,10,59,13],[59,14,59,15],[60,11,60,13],[60,14,60,15],[61,14,61,15],[63,10,63,13],[63,14,63,15],[62,10,62,13],[8,1,9,8],[55,1,56,8],[16,14,16,15],[8,9,9,16],[17,10,17,13],[16,10,16,13],[14,11,14,13],[13,11,13,13],[12,10,12,13],[17,14,17,15],[14,14,14,15],[13,14,13,15],[12,14,12,15],[18,14,18,15],[90,0,91,0],[64,10,64,13],[64,14,64,15],[65,14,65,15],[84,1,85,8],[87,1,88,8],[90,1,90,5],[91,1,91,5],[87,9,88,16],[72,11,72,16],[117,1,117,5],[118,1,118,5],[70,15,71,15],[15,14,15,15],[15,11,15,13],[62,14,62,15],[31,1,32,8],[31,9,32,16],[33,2,33,4],[37,10,37,13],[36,10,36,13],[37,14,37,15],[36,14,36,15],[38,14,38,15],[61,11,61,13],[113,1,114,8],[113,9,114,16],[116,1,116,5],[95,1,95,5],[96,1,96,5],[97,1,97,5],[98,1,98,5],[99,1,99,5],[100,1,100,5],[101,1,101,5],[111,1,111,5]]}
[]
[]
[]
[]
[]
[]
[]
[]
[null,"Total Initial Costs for POD Type I",null,null,null,null,null,null,null,{"$f":"O19","v":569428.4}]
[]
[null,null,null,null,null,null,null,null,null,null,null,null,null,null,null,null,null,null,null,"Source Data to be Hidden"]
[]
[null,null,null,null,null,null,null,null,null,null,{"$f":"T13","v":"Initial Equipment Costs: "},null,null,null,{"$f":"T14","v":498148.4},null,null,null,null,"Initial Equipment Costs: ","Initial Personnel Costs: ","Initial Training Costs: "]
[null,null,null,null,null,null,null,null,null,null,null,{"$f":"T16","v":"Loading Point Costs: "},null,null,{"$f":"T17","v":465454},null,null,null,null,{"$f":"'Type I Needs'!M26+'Type I Needs'!M44","v":498148.4},0,{"$f":"'Type I Needs'!M79","v":71280}]
[null,null,null,null,null,null,null,null,null,null,null,{"$f":"U16","v":"POD Kit Costs: "},null,null,{"$f":"U17","v":32694.399999999998}]
[null,null,null,null,null,null,null,null,null,null,null,"POD Supplies Costs: ",null,null,0,null,null,null,null,"Loading Point Costs: ","POD Kit Costs: ","Initial Training Costs: "]
[null,null,null,null,null,null,null,null,null,null,{"$f":"U13","v":"Initial Personnel Costs: "},null,null,null,{"$f":"U14","v":0},null,null,null,null,{"$f":"'Type I Needs'!M26","v":465454},{"$f":"'Type I Needs'!M44","v":32694.399999999998},{"$f":"'Type I Needs'!M79","v":71280}]
[null,null,null,null,null,null,null,null,null,null,{"$f":"V13","v":"Initial Training Costs: "},null,null,null,{"$f":"V14","v":71280}]
[null,null,null,null,null,null,null,null,null,null,null,null,null,null,{"$f":"SUM(O18,O17,O13)","v":569428.4}]
[]
{"$rows_left_out":100}
{"sheet":"Type II Needs","index":5,"n_rows":79,"n_cols":15,"rows_kept":79,"cut":false,"hidden":false,"merged":[[77,1,77,7],[65,1,65,7],[66,1,66,7],[67,1,67,7],[68,1,68,7],[72,1,73,8],[75,1,75,7],[76,1,76,7],[72,9,73,12],[40,1,40,8],[41,1,41,8],[42,1,42,8],[61,1,62,8],[61,9,62,12],[64,1,64,7],[48,1,48,8],[49,1,49,8],[46,11,47,12],[46,1,47,10],[39,1,39,8],[28,1,29,8],[28,9,29,12],[30,1,30,8],[31,1,31,8],[32,1,32,8],[33,1,33,8],[34,1,34,8],[35,1,35,8],[36,1,36,8],[37,1,37,8],[38,1,38,8],[24,1,24,8],[14,1,15,8],[14,9,15,12],[14,14,15,17],[16,1,16,8],[17,1,17,8],[18,1,18,8],[19,1,19,8],[20,1,20,8],[21,1,21,8],[22,1,22,8],[23,1,23,8],[8,2,8,5],[8,7,8,10],[9,7,9,13],[12,9,13,9],[12,10,13,10],[12,11,13,11],[12,12,13,12],[46,14,46,17],[47,14,57,17],[50,1,50,7],[50,8,51,8],[51,1,51,7],[52,1,52,7],[53,1,53,7],[54,1,54,7],[55,1,55,7],[56,1,56,7],[57,1,57,7]]}
[]
[]
[]
[]
[]
[]
[]
[]
[null,null,"Your capability need is",null,null,null,{"$f":"IF(InputPerNum=\"Percent\",'User Input'!L37,'User Input'!F47)","v":3},"Type II PODs, operating for",null,null,null,{"$f":"CONCATENATE(SUM('User Input'!I25:J25), \" days\")","v":"3 days"}]
[null,null,null,null,null,null,null,"You can adjust costs and quantities below to reflect your actual costs and needs."]
[]
[]
[null,null,null,null,null,null,null,null,null,"Default Quantities","Quantities","Unit Costs","Initial Cost"]
[]
[null,"Loading Point Equipment",null,null,null,null,null,null,null,{"$f":"M26","v":214935.75},null,null,null,null,"For more information about a Type II POD…"]
[]
[null,"Forklifts",null,null,null,null,null,null,null,{"$f":"TypeIIPODs*CostsQuants!K17","v":6},{"$f":"J17","v":6},25000,{"$f":"K17*L17","v":150000}]
[null,"Pallet Jacks",null,null,null,null,null,null,null,{"$f":"TypeIIPODs*CostsQuants!K18","v":6},6,365,{"$f":"K18*L18","v":2190}]
[null,"Power Light Set",null,null,null,null,null,null,null,{"$f":"TypeIIPODs*CostsQuants!K19","v":3},3,11230,33690]
[null,"Toilets",null,null,null,null,null,null,null,{"$f":"TypeIIPODs*CostsQuants!K20","v":12},12,686,8232]
{"$rows_left_out":60}
{"sheet":"Type II Costs","index":6,"n_rows":119,"n_cols":25,"rows_kept":119,"cut":false,"hidden":false,"merged":[[113,9,114,16],[116,1,116,5],[117,1,117,5],[118,1,118,5],[107,1,107,5],[108,1,108,5],[109,1,109,5],[110,1,110,5],[111,1,111,5],[113,1,114,8],[106,1,106,5],[95,1,95,5],[96,1,96,5],[97,1,97,5],[98,1,98,5],[101,1,101,5],[102,1,102,5],[103,1,103,5],[104,1,104,5],[105,1,105,5],[99,0,100,0],[99,1,99,5],[100,1,100,5],[90,0,91,0],[90,1,90,5],[91,1,91,5],[92,1,92,5],[93,1,93,5],[94,1,94,5],[65,14,65,15],[70,11,71,14],[70,15,71,15],[84,1,85,8],[87,1,88,8],[87,9,88,16],[72,11,72,16],[62,10,62,13],[62,14,62,15],[63,10,63,13],[63,14,63,15],[64,10,64,13],[64,14,64,15],[59,10,59,13],[59,14,59,15],[60,11,60,13],[60,14,60,15],[61,11,61,13],[61,14,61,15],[55,1,56,8],[17,10,17,13],[17,14,17,15],[18,14,18,15],[31,1,32,8],[31,9,32,16],[33,2,33,4],[36,10,36,13],[36,14,36,15],[37,10,37,13],[37,14,37,15],[38,14,38,15],[14,11,14,13],[14,14,14,15],[15,11,15,13],[15,14,15,15],[16,10,16,13],[16,14,16,15],[8,1,9,8],[8,9,9,16],[12,10,12,13],[12,14,12,15],[13,11,13,13],[13,14,13,15]]}
[]
[]
[]
[]
[]
[]
[]
[]
[null,"Total Initial Costs for POD Type II",null,null,null,null,null,null,null,{"$f":"O19","v":254736.15}]
[]
[null,null,null,null,null,null,null,null,null,null,null,null,null,null,null,null,null,null,null,"Source Data to be Hidden"]
[]
[null,null,null,null,null,null,null,null,null,null,{"$f":"T13","v":"Initial Equipment Costs: "},null,null,null,{"$f":"T14","v":227196.15},null,null,null,null,"Initial Equipment Costs: ","Initial Personnel Costs: ","Initial Training Costs: "]
[null,null,null,null,null,null,null,null,null,null,null,{"$f":"T16","v":"Loading Point Costs: "},null,null,{"$f":"T17","v":214935.75},null,null,null,null,{"$f":"'Type II Needs'!M26+'Type II Needs'!M44","v":227196.15},0,{"$f":"'Type II Needs'!M79","v":27540}]
[null,null,null,null,null,null,null,null,null,null,null,{"$f":"U16","v":"POD Kit Costs: "},null,null,{"$f":"U17","v":12260.4}]
[null,null,null,null,null,null,null,null,null,null,null,"POD Supplies Costs: ",null,null,0,null,null,null,null,"Loading Point Costs: ","POD Kit Costs: ","Initial Training Costs: "]
[null,null,null,null,null,null,null,null,null,null,{"$f":"U13","v":"Initial Personnel Costs: "},null,null,null,{"$f":"U14","v":0},null,null,null,null,{"$f":"'Type II Needs'!M26","v":214935.75},{"$f":"'Type II Needs'!M44","v":12260.4},{"$f":"'Type II Needs'!M79","v":27540}]
[null,null,null,null,null,null,null,null,null,null,{"$f":"V13","v":"Initial Training Costs: "},null,null,null,{"$f":"V14","v":27540}]
[null,null,null,null,null,null,null,null,null,null,null,null,null,null,{"$f":"SUM(O18,O17,O13)","v":254736.15}]
[]
{"$rows_left_out":100}
{"sheet":"Type III Needs","index":7,"n_rows":79,"n_cols":15,"rows_kept":79,"cut":false,"hidden":false,"merged":[[8,2,8,5],[8,7,8,10],[9,7,9,13],[12,9,13,9],[12,10,13,10],[12,11,13,11],[12,12,13,12],[24,1,24,8],[14,1,15,8],[14,9,15,12],[14,14,15,17],[16,1,16,8],[17,1,17,8],[18,1,18,8],[19,1,19,8],[20,1,20,8],[21,1,21,8],[22,1,22,8],[23,1,23,8],[39,1,39,8],[28,1,29,8],[28,9,29,12],[30,1,30,8],[31,1,31,8],[32,1,32,8],[33,1,33,8],[34,1,34,8],[35,1,35,8],[36,1,36,8],[37,1,37,8],[38,1,38,8],[46,11,47,12],[46,14,46,17],[47,14,57,17],[48,1,48,8],[49,1,49,8],[50,1,50,7],[55,1,55,7],[52,1,52,7],[53,1,53,7],[54,1,54,7],[40,1,40,8],[41,1,41,8],[42,1,42,8],[46,1,47,10],[50,8,51,8],[51,1,51,7],[72,9,73,12],[75,1,75,7],[56,1,56,7],[57,1,57,7],[61,1,62,8],[61,9,62,12],[64,1,64,7],[65,1,65,7],[76,1,76,7],[77,1,77,7],[66,1,66,7],[67,1,67,7],[68,1,68,7],[72,1,73,8]]}
[]
[]
[]
[]
[]
[]
[]
[]
[null,null,"Your capability need is",null,null,null,{"$f":"IF(InputPerNum=\"Percent\",'User Input'!L38,'User Input'!F48)","v":52},"Type III PODs, operating for",null,null,null,{"$f":"CONCATENATE(SUM('User Input'!I25:J25), \" days\")","v":"3 days"}]
[null,null,null,null,null,null,null,"You can adjust costs and quantities below to reflect your actual costs and needs."]
[]
[]
[null,null,null,null,null,null,null,null,null,"Default Quantities","Quantities","Unit Costs","Initial Cost"]
[]
[null,"Loading Point Equipment",null,null,null,null,null,null,null,{"$f":"M26","v":2158286},null,null,null,null,"For more information about a Type III POD…"]
[]
[null,"Forklifts",null,null,null,null,null,null,null,{"$f":"TypeIIIPODs*CostsQuants!L17","v":52},{"$f":"J17","v":52},25000,{"$f":"K17*L17","v":1300000}]
[null,"Pallet Jacks",null,null,null,null,null,null,null,{"$f":"TypeIIIPODs*CostsQuants!L18","v":52},52,365,{"$f":"K18*L18","v":18980}]
[null,"Power Light Set",null,null,null,null,null,null,null,{"$f":"TypeIIIPODs*CostsQuants!L19","v":52},52,11230,583960]
[null,"Toilets",null,null,null,null,null,null,null,{"$f":"TypeIIIPODs*CostsQuants!L20","v":104},104,686,71344]
{"$rows_left_out":60}
{"sheet":"Type III Costs","index":8,"n_rows":119,"n_cols":25,"rows_kept":119,"cut":false,"hidden":false,"merged":[[113,9,114,16],[116,1,116,5],[117,1,117,5],[118,1,118,5],[107,1,107,5],[108,1,108,5],[109,1,109,5],[110,1,110,5],[111,1,111,5],[113,1,114,8],[106,1,106,5],[95,1,95,5],[96,1,96,5],[97,1,97,5],[98,1,98,5],[101,1,101,5],[102,1,102,5],[103,1,103,5],[104,1,104,5],[105,1,105,5],[99,0,100,0],[99,1,99,5],[100,1,100,5],[90,0,91,0],[90,1,90,5],[91,1,91,5],[92,1,92,5],[93,1,93,5],[94,1,94,5],[65,14,65,15],[70,11,71,14],[70,15,71,15],[84,1,85,8],[87,1,88,8],[87,9,88,16],[72,11,72,16],[62,10,62,13],[62,14,62,15],[63,10,63,13],[63,14,63,15],[64,10,64,13],[64,14,64,15],[59,10,59,13],[59,14,59,15],[60,11,60,13],[60,14,60,15],[61,11,61,13],[61,14,61,15],[55,1,56,8],[17,10,17,13],[17,14,17,15],[18,14,18,15],[31,1,32,8],[31,9,32,16],[33,2,33,4],[36,10,36,13],[36,14,36,15],[37,10,37,13],[37,14,37,15],[38,14,38,15],[14,11,14,13],[14,14,14,15],[15,11,15,13],[15,14,15,15],[16,10,16,13],[16,14,16,15],[8,1,9,8],[8,9,9,16],[12,10,12,13],[12,14,12,15],[13,11,13,13],[13,14,13,15]]}
[]
[]
[]
[]
[]
[]
[]
[]
[null,"Total Initial Costs for POD Type III",null,null,null,null,null,null,null,{"$f":"O19","v":2503222.7999999998}]
[]
[null,null,null,null,null,null,null,null,null,null,null,null,null,null,null,null,null,null,null,"Source Data to be Hidden"]
[]
[null,null,null,null,null,null,null,null,null,null,{"$f":"T13","v":"Initial Equipment Costs: "},null,null,null,{"$f":"T14","v":2264542.7999999998},null,null,null,null,"Initial Equipment Costs: ","Initial Personnel Costs: ","Initial Training Costs: "]
[null,null,null,null,null,null,null,null,null,null,null,{"$f":"T16","v":"Loading Point Costs: "},null,null,{"$f":"T17","v":2158286},null,null,null,null,{"$f":"'Type III Needs'!M26+'Type III Needs'!M44","v":2264542.7999999998},0,{"$f":"'Type III Needs'!M79","v":238680}]
[null,null,null,null,null,null,null,null,null,null,null,{"$f":"U16","v":"POD Kit Costs: "},null,null,{"$f":"U17","v":106256.8}]
[null,null,null,null,null,null,null,null,null,null,null,"POD Supplies Costs: ",null,null,0,null,null,null,null,"Loading Point Costs: ","POD Kit Costs: ","Initial Training Costs: "]
[null,null,null,null,null,null,null,null,null,null,{"$f":"U13","v":"Initial Personnel Costs: "},null,null,null,{"$f":"U14","v":0},null,null,null,null,{"$f":"'Type III Needs'!M26","v":2158286},{"$f":"'Type III Needs'!M44","v":106256.8},{"$f":"'Type III Needs'!M79","v":238680}]
[null,null,null,null,null,null,null,null,null,null,{"$f":"V13","v":"Initial Training Costs: "},null,null,null,{"$f":"V14","v":238680}]
[null,null,null,null,null,null,null,null,null,null,null,null,null,null,{"$f":"SUM(O18,O17,O13)","v":2503222.7999999998}]
[]
{"$rows_left_out":100}
{"sheet":"Initial Costs","index":9,"n_rows":129,"n_cols":20,"rows_kept":129,"cut":false,"hidden":false,"merged":[[124,2,124,8],[125,2,125,8],[126,2,126,8],[127,2,127,8],[128,2,128,8],[118,2,118,9],[119,2,119,9],[120,2,120,9],[121,2,122,9],[121,10,122,13],[113,2,113,9],[114,2,114,9],[115,2,115,9],[116,2,116,9],[117,2,117,9],[111,2,111,9],[112,2,112,9],[100,10,101,13],[103,2,103,8],[104,2,104,8],[105,2,105,8],[108,2,109,9],[108,10,109,13],[100,2,101,9],[95,2,95,9],[96,2,96,9],[97,2,97,9],[98,2,98,9],[99,2,99,9],[94,2,94,9],[83,2,83,9],[84,2,84,9],[85,2,86,9],[85,10,86,13],[87,2,87,9],[88,2,88,9],[89,2,89,9],[90,2,90,9],[91,2,91,9],[92,2,92,9],[93,2,93,9],[82,2,82,9],[54,12,54,13],[70,1,71,8],[70,9,71,14],[74,2,75,9],[74,10,75,13],[76,2,76,9],[60,9,60,14],[77,2,77,9],[78,2,78,9],[79,2,79,9],[80,2,80,9],[81,2,81,9],[47,1,48,8],[47,9,48,14],[53,9,53,11],[52,9,52,11],[53,12,53,13],[52,12,52,13],[8,1,9,8],[8,9,9,14],[11,2,11,5],[11,6,11,7],[58,9,59,12],[58,13,59,13],[13,2,13,6],[25,1,26,8],[25,9,26,14],[32,9,32,11],[31,9,31,11],[30,9,30,11],[32,12,32,13],[31,12,31,13],[30,12,30,13],[33,12,33,13]]}
[]
[]
[]
[]
[]
[]
[]
[]
[null,"Input Summary"]
[]
[]
[null,null,"Total population to be served with PODs: ",null,null,null,{"$f":"SUM('User Input'!H17:I17)","v":225000}]
[]
[null,null,"POD Type Distribution:"]
[null,null,null,null,"Type I",null,{"$f":"TypeIPODs","v":4}]
[null,null,null,null,"Type II",null,{"$f":"TypeIIPODs","v":3}]
[null,null,null,null,"Type III",null,{"$f":"TypeIIIPODs","v":52}]
[]
[]
[]
{"$rows_left_out":110}
{"sheet":"Annual Costs","index":10,"n_rows":63,"n_cols":22,"rows_kept":63,"cut":false,"hidden":false,"merged":[[25,1,26,8],[25,9,26,14],[50,9,50,12],[52,10,52,12],[8,1,9,8],[8,9,9,14],[11,2,11,5],[11,6,11,7],[13,2,13,6],[29,9,29,11],[33,10,33,12],[32,10,32,12],[31,10,31,12],[30,10,30,12],[60,9,61,12],[60,13,61,13],[62,9,62,14],[51,9,51,12],[54,9,54,12],[55,9,55,12],[56,9,56,12],[53,10,53,12]]}
[]
[]
[]
[]
[]
[]
[]
[]
[null,"Input Summary"]
[]
[]
[null,null,"Total population to be served with PODs: ",null,null,null,{"$f":"SUM('User Input'!H17:I17)","v":225000}]
[]
[null,null,"POD Type Distribution:"]
[null,null,null,null,"Type I",null,{"$f":"TypeIPODs","v":4}]
[null,null,null,null,"Type II",null,{"$f":"TypeIIPODs","v":3}]
[null,null,null,null,"Type III",null,{"$f":"TypeIIIPODs","v":52}]
[]
[]
[]
{"$rows_left_out":44}
{"sheet":"Gap Costs","index":11,"n_rows":77,"n_cols":22,"rows_kept":77,"cut":false,"hidden":false,"merged":[[29,9,29,11],[9,1,10,8],[12,2,12,5],[12,6,12,9],[12,10,12,13],[9,9,10,14],[21,1,22,8],[21,9,22,14],[26,9,26,11],[27,9,27,11],[28,9,28,11],[25,9,25,11],[26,12,26,13],[27,2,31,7],[27,12,27,13],[28,12,28,13],[43,9,43,13],[29,12,29,13],[30,12,30,13],[70,13,70,14],[74,9,75,12],[74,13,75,13],[69,13,69,14],[48,12,48,13],[47,9,47,11],[44,12,44,13],[45,12,45,13],[46,12,46,13],[47,12,47,13],[44,9,44,11],[45,9,45,11],[46,9,46,11],[76,9,76,14],[63,9,63,13],[64,9,64,12],[65,9,65,12],[66,9,66,12],[67,9,67,12],[68,9,68,12],[69,9,69,12],[64,13,64,14],[65,13,65,14],[66,13,66,14],[67,13,67,14],[68,13,68,14]]}
[]
[]
[]
[]
[]
[]
[]
[]
[]
[null,"Gap Calculation"]
[]
[]
[null,null,"Suggested Number of PODs by Type",null,null,null,"Current PODs by Type",null,null,null,"Difference Between Current and Suggested",null,null,null,null,null,null,null,null,"Effective Gap"]
[null,null,null,"Type I",{"$f":"TypeIPODs","v":4},null,null,"Type I",0,null,null,"Type I",{"$f":"I14-E14","v":-4},null,null,null,null,null,null,{"$f":"IF(M14<=0,ABS(M14),0)","v":4}]
[null,null,null,"Type II",{"$f":"TypeIIPODs","v":3},null,null,"Type II",1,null,null,"Type II",{"$f":"I15-E15","v":-2},null,null,null,null,null,null,{"$f":"IF(M15<=0,ABS(M15),0)","v":2}]
[null,null,null,"Type III",{"$f":"TypeIIIPODs","v":52},null,null,"Type III",4,null,null,"Type III",-48,null,null,null,null,null,null,48]
[]
[null,null,null,null,null,null,null,null,null,null,null,null,null,null,null,null,null,"Effective Gap",{"$f":"T14","v":4},{"$f":"T15","v":2},{"$f":"T16","v":48}]
[]
[]
{"$rows_left_out":58}
{"sheet":"HoldShapes","index":12,"n_rows":78,"n_cols":23,"rows_kept":78,"cut":false,"hidden":true,"merged":[[77,12,77,13],[11,1,12,8],[17,1,17,8],[44,2,45,7],[47,2,47,5],[11,9,12,12],[15,1,15,7]]}
[]
[]
[]
[]
[]
[]
[]
[]
[]
[]
[]
[]
[]
[]
[]
[]
[]
[]
[]
[]
{"$rows_left_out":59}
{"sheet":"Lists","index":13,"n_rows":2,"n_cols":1,"rows_kept":2,"cut":false,"hidden":true,"merged":[]}
["Percent"]
["Number"]

{"sheet":"FormatHold","index":14,"n_rows":0,"n_cols":0,"rows_kept":0,"cut":false,"hidden":true,"merged":[[15,7,15,9],[19,2,19,10],[3,2,3,3],[3,8,3,9],[14,2,14,3],[14,6,14,10]]}

{"sheet":"CostsQuants","index":15,"n_rows":78,"n_cols":14,"rows_kept":78,"cut":false,"hidden":true,"merged":[[72,0,73,7],[72,8,73,13],[14,0,15,7],[14,8,15,13],[28,0,29,7],[28,8,29,13],[61,0,62,7],[61,8,62,13],[46,0,47,8],[46,9,47,13]]}
[]
[]
[]
[]
[]
[]
[]
[]
[]
[]
[]
[]
[]
[null,null,null,null,null,null,null,null,null,"Q Type I","Q Type II","Q Type III","C"]
["Loading Point Equipment"]
[]
["Forklifts",null,null,null,null,null,null,null,null,3,2,1,25000]
["Pallet Jacks",null,null,null,null,null,null,null,null,3,2,1,365]
["Power Light Set",null,null,null,null,null,null,null,null,2,1,1,11230]
["Toilets",null,null,null,null,null,null,null,null,6,4,2,686]
{"$rows_left_out":58}